"""personnel"".""nom""","""personnel"".""burtelephone""","""personnel"".""burtelephonebis""","""personnel"".""mail""","""personnel"".""groupe""","""personnel"".""piece""","""personnel"".""picture""","""personnel"".""id""","""personnel"".""login""","""personnel"".""prenom""","""personnel"".""pays""","""personnel"".""sexe""","""personnel"".""employeur""","""personnel"".""cdd""","""personnel"".""categorie""","""personnel"".""corps""","""personnel"".""batiment""","""personnel"".""dateaffectationiins""","""personnel"".""financement""","""personnel"".""acronyme""","""personnel"".""quotite""","""personnel"".""unite""","""personnel"".""present""","""personnel"".""datedebutcontrat""","""personnel"".""datefincontrat""","""personnel"".""rgpd""","""personnel"".""platform""","""personnel"".""chef_equipe"""
POUJOL,033557573765,<NULL>,christel.poujol@u-bordeaux.fr,BIC,,personnel.picture.a8fc44add8d30665.74656d706c6174652e6a7067.jpg,353,cpoujol,Christel,France,F,CNRS,TITU,Technical staff,IR,NEUROCAMPUS,2000-01-01,1,,,IINS,present,2011-01-01,2000-01-01,yes,<NULL>,<NULL>
MARAIS,+33557573601,<NULL>,sebastien.marais@u-bordeaux.fr,BIC,,personnel.picture.88a0fa705e4bad4d.74656d706c6174652e6a7067.jpg,354,smarai100p,Sébastien,France,M,CNRS,TITU,Technical staff,IE,NEUROCAMPUS,2000-01-01,1,,,IINS,present,2011-01-01,2000-01-01,yes,<NULL>,<NULL>
MONDIN,+33533514788,<NULL>,magali.mondin@u-bordeaux.fr,BIC,,personnel.picture.ace4fa7f9d8c1ed3.74656d706c6174652e6a7067.jpg,355,mmondi100p,Magali,France,F,CNRS,TITU,Technical staff,IE,NEUROCAMPUS,2000-01-01,1,,,IINS,present,2018-09-01,2099-12-31,yes,<NULL>,<NULL>
GONTIER,+33533514700,+33533514700,etienne.gontier@u-bordeaux.fr,BIC,,personnel.picture.a763f87ed091a34d.74656d706c6174652e6a7067.jpg,356,egonti100p,Etienne,France,M,UB,TITU,Technical staff,IR,NEUROCAMPUS,2000-01-01,1,,100,IINS,present,2011-01-01,2057-01-01,yes,other,no
CORDELIERES,+33557573604,<NULL>,fabrice.cordelieres@u-bordeaux.fr,BIC,,personnel.picture.ac34b52437bc71d3.74656d706c6174652e6a7067.jpg,492,fcorde100p,Fabrice,France,M,CNRS,TITU,Technical staff,IR,MAGENDIE,2000-01-01,1,,,IINS,present,2013-07-01,2000-01-01,yes,<NULL>,<NULL>
LACOMME,+33557571762,<NULL>,sabrina.lacomme@u-bordeaux.fr,BIC,,personnel.picture.b1e34315f5b72cba.74656d706c6174652e6a7067.jpg,494,slacom100p,Sabrina,France,F,UB,TITU,Technical staff,T,MAGENDIE,2000-01-01,1,,100,IINS,present,2011-01-01,2000-01-01,yes,<NULL>,<NULL>
SVAHN,+33557574745,<NULL>,isabelle.svahn@u-bordeaux.fr,BIC,,personnel.picture.96305f831e17cc7e.74656d706c6174652e6a7067.jpg,496,isvahn,Isabelle,France,F,UB,TITU,Technical staff,T,PGF,2000-01-01,1,,,IINS,present,2011-01-01,2031-01-31,yes,<NULL>,<NULL>
GIRARD,+33533514748,+33533514748,jordan.girard@u-bordeaux.fr,NAGERL,,personnel.picture.b375046c6cb82196.4a6f7264616e204769726172642e6a7067.jpg,1353,jorgirar,Jordan,France,M,UB,CDD,Technical staff,IE,NEUROCAMPUS,2021-09-01,ERC,ENSEMBLE VN,100,IINS,present,2021-09-01,2024-08-31,yes,other,no
FERNANDEZ MONREAL,+33533514790,<NULL>,monica.fernandez-monreal@u-bordeaux.fr,BIC,112,personnel.picture.9c57d0cb38d790b0.74656d706c6174652e6a7067.jpg,734,mfmonreal,Monica,Spain,F,CNRS,TITU,Technical staff,IR,NEUROCAMPUS,2017-02-01,None,,100,IINS,present,2017-02-01,2099-12-31,yes,<NULL>,<NULL>
CHEVRIER,+33533514733,+33533514733,nicolas.chevrier@u-bordeaux.fr,CHOQUET,125,personnel.picture.83102174e16f75f0.4e69636f6c61732043686576726965722e6a7067.jpg,755,nchevrier001,Nicolas,France,M,NONE,CDI,Technical staff,AI,NEUROCAMPUS,2017-08-01,ADERA,ADERA,100,IINS,present,2022-09-01,2099-12-31,yes,cell,no
GETZ,+33533514735,+33533514735,angela.getz@u-bordeaux.fr,CHOQUET,125,personnel.picture.80b539064c4e693c.416e67656c61204765747a2e6a7067.jpg,794,agetz,Angela,Canada,F,NONE,CDI,Postdoc,POSTDOC,NEUROCAMPUS,2017-11-28,ADERA,ADERA,100,IINS,present,2022-11-28,2099-12-31,yes,other,no
COUSSEN,+33533514734,+33533514734,francoise.coussen-choquet@u-bordeaux.fr,CHOQUET,135,personnel.picture.8f73029afb9a422a.4672616e636f697365436f757373656e5f4e65775f323030783230302e6a7067.jpg,122,fcoussen,Francoise,France,F,CNRS,TITU,Researcher,DR,NEUROCAMPUS,2011-01-01,,,100,IINS,present,2000-10-15,2000-01-01,yes,cell,no
SAINLOS,+33533514731,+33533514700,matthieu.sainlos@u-bordeaux.fr,CHOQUET,136,personnel.picture.8942677e93cbf0fb.74656d706c6174652e6a7067.jpg,16,msainl100p,Matthieu,France,M,CNRS,TITU,Researcher,DR,NEUROCAMPUS,2011-01-01,,,100,IINS,present,2001-01-31,2000-01-01,yes,other,no
BREILLAT,+33533514731,<NULL>,christelle.breillat@u-bordeaux.fr,CHOQUET,136,personnel.picture.823b401062f26508.436872697374656c6c655f427265696c6c6174202d2032303070782e4a5047.JPG,111,breillat,Christelle,France,F,CNRS,TITU,Technical staff,IR,NEUROCAMPUS,2011-01-01,,,100,IINS,present,1999-05-01,2000-01-01,yes,cell,no
Daburon,+33533514732,+33533514732,sophie.daburon@u-bordeaux.fr,CHOQUET,138,personnel.picture.bc3b2500b337709c.44616275726f6e2d536f706869652d49494e532d4453435f353330332d32303070782e6a7067.jpg,552,sdaburon,Sophie,France,F,CNRS,TITU,Technical staff,AI,NEUROCAMPUS,2015-10-01,,,100,IINS,present,1997-11-01,2000-11-02,yes,cell,no
BRACHET,+33533514732,<NULL>,anna.brachet@u-bordeaux.fr,CHOQUET,138,personnel.picture.a5706113114ea2d2.74656d706c6174652e6a7067.jpg,731,abrachet001,Anna,France,F,CNRS,TITU,Researcher,CR,NEUROCAMPUS,2017-02-01,None,,100,IINS,present,2017-02-01,2000-12-31,yes,other,no
RETAILLEAU,+33533514733,+33533514733,natacha.retailleau@u-bordeaux.fr,PBC,139,personnel.picture.ab0b56a747030deb.4e6174616368612052657461696c6c6561752e6a7067.jpg,65,nretai100p,Natacha,France,F,UB,CDI,Technical staff,AI,NEUROCAMPUS,2011-01-01,BIC,,100,BIC,present,2023-07-01,2099-12-31,yes,cell,no
CHOQUET,+33533514715,<NULL>,daniel.choquet@u-bordeaux.fr,CHOQUET,140,personnel.picture.9f0019e359220cf0.44616e69656c43686f717565745f4e65775f323030783230302e6a7067.jpg,119,dchoquet,Daniel,France,M,CNRS,TITU,Researcher,DR,NEUROCAMPUS,2011-01-01,,,,IINS,present,2000-09-01,2000-01-01,yes,other,yes
HOSY,+33533514730,<NULL>,eric.hosy@u-bordeaux.fr,CHOQUET,141,personnel.picture.b57f6793819a3085.74656d706c6174652e6a7067.jpg,53,ehosy100p,Eric,France,M,CNRS,TITU,Researcher,CR,NEUROCAMPUS,2011-01-01,,,100,IINS,present,2009-10-01,2000-01-01,yes,other,no
TESSIER,+33533514729,+33533514729,beatrice.tessier@u-bordeaux.fr,LETELLIER_FAVEREAUX,142,personnel.picture.8824b8ac3d7c8de1.42c3a961747269636520746573736965722032303070782e6a7067.jpg,8,bteiss100p,Beatrice,France,F,CNRS,TITU,Technical staff,IE,NEUROCAMPUS,2011-01-01,,,100,IINS,present,2006-02-20,2000-01-01,yes,cell,no
LETELLIER,+33533514729,+33533514729,mathieu.letellier@u-bordeaux.fr,LETELLIER_FAVEREAUX,142,personnel.picture.92b5bd18a4d62cc7.4d61747468696575204c6574656c6c6965722032303070782e6a7067.jpg,462,mletel100p,Mathieu,France,M,CNRS,TITU,Researcher,CR,NEUROCAMPUS,2012-09-01,,,100,IINS,present,2016-10-01,2099-12-31,yes,other,yes
CHAMMA,+33533514746,+33533514746,ingrid.chamma@u-bordeaux.fr,STUDER,142,personnel.picture.9d261d3e0524cfe0.74656d706c6174652e6a7067.jpg,538,ichamm100p,Ingrid,France,F,INSERM,TITU,Researcher,CR,NEUROCAMPUS,2013-01-15,,,100,IINS,present,2021-01-01,2099-12-31,yes,other,no
THOUMINE,+33533514704,+33533514704,olivier.thoumine@u-bordeaux.fr,SIBARITA,143,personnel.picture.ab4603f420175938.74686f756d696e652d4453435f313737352063617272652e6a7067.jpg,7,othoumin,Olivier,France,M,CNRS,TITU,Researcher,DR,NEUROCAMPUS,2011-01-01,,,100,IINS,present,2001-10-01,2000-01-01,yes,other,no
NOWACKA,+33533514749,+33533514749,agata.nowacka@u-bordeaux.fr,CHOQUET,146,personnel.picture.98a833acd82f1d8c.4167617461204e6f7761636b612e6a7067.jpg,960,anowacka,Agata,Poland,F,CNRS,CDD,Postdoc,POSTDOC,NEUROCAMPUS,2019-09-16,ERC,Dyn-Syn-Mem,100,IINS,present,2023-11-15,2024-08-31,yes,other,no
TRIVUNOVIC,+33533514749,+33533514749,ivana.trivunovic@u-bordeaux.fr,CHOQUET,146,personnel.picture.a2fcf7349a0193f8.74726976756e6f7669632d6976616e612d4453435f393632392d702e6a7067.jpg,1093,itrivunovic,Ivana,Serbia and Montenegro,F,UB,CDD,PhD student,DOCTORANT,NEUROCAMPUS,2020-10-15,GPR BRAIN,BS,100,IINS,present,2023-10-15,2024-10-14,yes,other,no
GIANNONE,+33533514708,+33533514708,gregory.giannone@u-bordeaux.fr,GIANNONE,147,personnel.picture.81fd00ed845c1d6b.6769616e6e6f6e652d677265676f72792d4453435f383036332d2d32303070782e6a7067.jpg,85,ggiann100p,Gregory,France,M,CNRS,TITU,Researcher,DR,NEUROCAMPUS,2011-11-01,,,100,IINS,present,2005-01-01,2000-01-01,yes,other,yes
ROSSIER,+33533514742,+33533514742,olivier.rossier@u-bordeaux.fr,GIANNONE,148,personnel.picture.bbb44ada50b3e9b2.726f73736965722d6f6c69766965722d4453435f383034372d32303070782e6a7067.jpg,284,orossi100p,Olivier,France,M,INSERM,TITU,Researcher,CR,NEUROCAMPUS,2011-01-01,,,100,IINS,present,2013-10-01,2000-01-01,yes,other,no
FABRE,+33533514742,+33533514742,melanie.fabre@u-bordeaux.fr,GIANNONE,148,personnel.picture.a90c30f8a86aa888.66616272652d6d656c616e69652d4453435f383032332d2d32303070782e6a7067.jpg,761,mfabre010,Mélanie,France,F,CNRS,TITU,Technical staff,AI,NEUROCAMPUS,2017-09-01,None,,100,IINS,present,2017-09-01,2099-12-31,yes,cell,no
CERCY,+33533514783,+33533514783,maureen.cercy@u-bordeaux.fr,GIANNONE,149,personnel.picture.bd71aba3791d574d.63657263792d6d61757265656e2d4453435f383033352d32303070782e6a7067.jpg,900,mcercy,Maureen,France,F,CNRS,CDD,Postdoc,POSTDOC,NEUROCAMPUS,2018-10-01,ANR,CryoNanoLam,100,IINS,present,2024-01-01,2024-06-30,yes,other,no
JOLY,+33533514783,+33533514783,adrien.joly@u-bordeaux.fr,GIANNONE,149,personnel.picture.9fee24a3615cb237.6a6f6c792d61647269656e2d4453435f383034302d32303070782e6a7067.jpg,961,adjoly,Adrien,France,M,CNRS,CDD,Postdoc,POSTDOC,NEUROCAMPUS,2019-09-15,ITMO,NanoTopoTams,100,IINS,present,2024-01-01,2024-12-31,yes,other,no
ZHOU,+33533514783,+33533514783,xuesi.zhou@u-bordeaux.fr,GIANNONE,149,personnel.picture.9b35713a1083fe44.7a686f752d78756573692d4453435f383033362d32303070782e6a7067.jpg,1101,xuezhou,XUESI,China,F,UB,CDD,PhD student,DOCTORANT,NEUROCAMPUS,2020-11-01,BOURSE CSC,BOURSE CSC,100,IINS,present,2020-11-01,2024-10-31,yes,other,no
PERRAIS,+33533514861,+33533514861,david.perrais@u-bordeaux.fr,PERRAIS,150A,personnel.picture.b3b67d3d25775ce8.44617669645f506572726169732e6a7067.jpg,70,dperrais,David,France,M,CNRS,TITU,Researcher,DR,NEUROCAMPUS,2011-01-01,None,,100,IINS,present,2020-02-19,2099-12-31,yes,other,yes
HERZOG,+33533514861,+33533514861,etienne.herzog@u-bordeaux.fr,PERRAIS,150B,personnel.picture.9f135b8511dc47dd.457469656e6e655f4865727a6f672e6a7067.jpg,54,eherzo100p,Etienne,France,M,CNRS,TITU,Researcher,CR,NEUROCAMPUS,2011-10-01,,,100,IINS,present,2020-02-19,2099-12-31,yes,other,no
BOUIT,+33533514861,+33533514861,lou.bouit.1@u-bordeaux.fr,PERRAIS,150B,personnel.picture.8bdea75cd1b64093.4c6f755f426f7569742e6a7067.jpg,851,lobouit,Lou,France,F,NONE,CDI,Technical staff,AI,NEUROCAMPUS,2018-05-15,INOVARION,INOVARION,100,IINS,present,2022-02-08,2099-12-31,yes,cell,no
SPOSINI,+33533514861,+33533514861,silvia.sposini@u-bordeaux.fr,PERRAIS,150B,personnel.picture.921e435dc27a8d77.53796c7669615f53706f73696e692e6a7067.jpg,872,ssposini,Silvia,Italy,F,NONE,CDD,Postdoc,POSTDOC,NEUROCAMPUS,2018-08-01,ICL,ICL,100,IINS,present,2020-08-01,2025-01-25,yes,other,no
LAPIOS,+33533514779,+33533514779,paul.lapios@u-bordeaux.fr,PERRAIS,150B,personnel.picture.aa56dd07cc626514.5061756c5f4c6170696f732e6a7067.jpg,1085,plapios,Paul,France,M,UB,CDD,PhD student,DOCTORANT,NEUROCAMPUS,2020-10-01,FRM,FRM,100,IINS,present,2023-10-01,2024-09-30,yes,other,no
LEVET,+33533514747,+33533514747,florian.levet@inserm.fr,SIBARITA,163,personnel.picture.b65d5b910482b87c.776562736974655f666c6f7269616e2e6a7067.jpg,252,flevet100p,Florian,France,M,INSERM,TITU,Technical staff,IR,NEUROCAMPUS,2000-01-01,1,,,IINS,present,2000-01-01,2000-01-01,yes,other,no
ANGIBAUD,+33533514748,+33533514748,julie.angibaud@u-bordeaux.fr,PERRAIS,163,personnel.picture.b55b187ab21bf810.4a756c69655f416e6769626175642e6a7067.jpg,311,jangib100p,Julie,France,F,UB,TITU,Technical staff,IE,NEUROCAMPUS,2011-01-01,,,100,IINS,present,2020-02-27,2099-12-31,yes,cell,no
GALLAND,+33533514748,+33533514748,remi.galland@u-bordeaux.fr,SIBARITA,163,personnel.picture.b32373265236325e.776562736974655f72656d692e6a7067.jpg,529,rgalla100p,Remi,France,M,CNRS,TITU,Researcher,CR,NEUROCAMPUS,2013-01-01,,,100,IINS,present,2015-10-01,2099-12-31,yes,other,no
STUDER,+33533514744,<NULL>,vincent.studer@u-bordeaux.fr,STUDER,167,personnel.picture.8bb840024b8645b4.5374756465725f56696e63656e745f576562736974652e6a7067.jpg,10,vstude910e,Vincent,France,M,CNRS,TITU,Researcher,DR,NEUROCAMPUS,2011-01-01,,,100,IINS,present,2001-05-01,2099-12-31,yes,other,yes
SIBARITA,+33533514706,+33533514706,jean-baptiste.sibarita@u-bordeaux.fr,SIBARITA,167,personnel.picture.93541918554ef8a9.776562736974655f6a622e6a7067.jpg,15,jsibar100p,Jean-Baptiste,France,M,CNRS,TITU,Technical staff,IR,NEUROCAMPUS,2011-01-01,,,100,IINS,present,2000-01-01,2000-01-01,yes,other,yes
NÄGERL,+33533514707,+33533514707,valentin.nagerl@u-bordeaux.fr,NAGERL,168,personnel.picture.b4a9c1589eba2723.56616c656e74696e204ec3a46765726c2032303070782e6a7067.jpg,34,vnager100p,Valentin,Germany,M,UB,TITU,Researcher,None,NEUROCAMPUS,2011-01-01,,,,IINS,present,2000-01-01,2000-01-01,yes,other,yes
LOPEZ,+33533514709,<NULL>,cedric.lopez@u-bordeaux.fr,ADMINISTRATION,205,personnel.picture.8ae0311abc9d6bc2.74656d706c6174652e6a7067.jpg,74,clopez100p,Cedric,France,M,UB,CDI,Technical staff,IR,NEUROCAMPUS,2011-01-01,,,100,IINS,present,2013-12-06,2099-12-31,yes,<NULL>,<NULL>
DESSANS,+33533514711,<NULL>,melanie.dessans@u-bordeaux.fr,ADMINISTRATION,205,personnel.picture.9ca1ca500439ccf9.74656d706c6174652e6a7067.jpg,511,mdessa100p,Melanie,France,F,UB,TITU,Technical staff,AI,NEUROCAMPUS,2011-01-01,,,100,IINS,present,2014-12-15,2000-01-01,yes,<NULL>,<NULL>
LEDO,+33533514712,<NULL>,arlette.ledo@u-bordeaux.fr,ADMINISTRATION,209,personnel.picture.b549b2af855631f9.74656d706c6174652e6a7067.jpg,369,aledo100p,Arlette,France,F,CNRS,TITU,Technical staff,IE,NEUROCAMPUS,2013-07-01,1,,100,IINS,present,2013-07-01,2000-01-01,yes,<NULL>,<NULL>
SAINT-AMAUX,+33533514778,<NULL>,aurelie.saint-amaux@u-bordeaux.fr,HUMEAU,217,personnel.picture.a50ea43b8d05f602.73742d616d6175782d617572656c69652d776562736974652e6a7067.jpg,884,asamaux,Aurélie,France,F,CNRS,TITU,Technical staff,IE,NEUROCAMPUS,2018-09-01,None,,100,IINS,present,2018-09-01,2099-12-31,yes,other,no
EL AZRAOUI,+33533514778,+33533514778,anass.el-azraoui@u-bordeaux.fr,HUMEAU,217,personnel.picture.a563706909e6741f.74656d706c617465202832292e6a7067.jpg,936,aeazraoui,Anass,Italy,M,CNRS,CDD,PhD student,IE,NEUROCAMPUS,2019-05-27,ANR,EXIN-MEMORY,100,IINS,present,2024-04-01,2024-11-30,yes,other,no
HUMEAU,+33533514703,<NULL>,yann.humeau@u-bordeaux.fr,HUMEAU,219,personnel.picture.99cdae92d5ffadb2.68756d6561752d79616e6e2d776562736974652e6a7067.jpg,51,yhumea100p,Yann,France,M,CNRS,TITU,Researcher,DR,NEUROCAMPUS,2011-11-01,,,100,IINS,present,2004-01-01,2000-01-01,yes,other,yes
ROUX,+33533514851,+33533514851,lisa.roux@u-bordeaux.fr,ROUX,222,personnel.picture.849b0abdbdfd7341.526f75782d4c6973612e6a7067.jpg,793,lroux004,Lisa,France,F,CNRS,TITU,Researcher,CR,NEUROCAMPUS,2017-12-01,None,,100,IINS,present,2017-12-01,2099-12-31,yes,other,yes
GAMBINO,+33533514701,+33533514701,frederic.gambino@u-bordeaux.fr,GAMBINO,223,personnel.picture.a5f2fcc7a051e98f.46726564657269635f47616d62696e6f5f323070782e6a7067.jpg,491,fregambino,Frederic,France,M,CNRS,TITU,Researcher,CR,NEUROCAMPUS,2014-03-01,,,100,IINS,present,2014-11-01,2000-01-01,yes,other,yes
CADORET,+33533514701,+33533514701,marie-anne.cadoret@u-bordeaux.fr,ROUX,223,personnel.picture.88392d1026f7da0b.4d617269652d416e6e655f4361646f7265745f323070782e6a7067.jpg,1001,mcador100p,Marie-Anne,France,F,CNRS,TITU,Technical staff,IE,NEUROCAMPUS,2020-01-01,None,,50,IINS,present,2020-01-01,2099-12-31,yes,other,no
SPITSYN,+33533514852,+33533514852,alena.spitsyn@u-bordeaux.fr,ROUX,224,personnel.picture.8c85b68b1a454d6b.416c656e615370697473796e2e6a7067.jpg,1010,aspitsyn,Aléna,Russia,F,UB,CDD,PhD student,DOCTORANT,NEUROCAMPUS,2020-01-20,ENS,ENS,100,IINS,present,2021-10-01,2024-09-30,yes,other,no
CASALI,+33533514852,+33533514852,giulio.casali@u-bordeaux.fr,ROUX,224,personnel.picture.833948633f347ce7.4769756c696f436173616c692e6a7067.jpg,1043,gcasali,Giulio,Italy,M,CNRS,CDD,Postdoc,POSTDOC,NEUROCAMPUS,2020-05-01,ERC,SOCIOLFA,100,IINS,present,2020-05-01,2025-04-30,yes,other,no
GROSJEAN,+33533514780,+33533514780,noelle.grosjean@u-bordeaux.fr,MULLE_CARTA,233,personnel.picture.887cab1212899ff0.6e6f656c6c652e6a706567.jpeg,57,ngrosj100p,Noelle,France,F,CNRS,TITU,Technical staff,AI,NEUROCAMPUS,2011-01-01,,,100,IINS,present,2009-12-01,2000-01-01,yes,other,no
DEFORGES,+33533514780,+33533514780,severine.deforges@u-bordeaux.fr,MULLE_CARTA,233,personnel.picture.843d93e683fd7623.6465666f726765735f7365766572696e655f70726f2e6a7067.jpg,124,sdefor100p,Severine,France,F,CNRS,TITU,Technical staff,IR,NEUROCAMPUS,2011-09-01,,,100,IINS,present,2019-05-01,2099-12-31,yes,cell,no
ERHARDT,+33533514780,+33533514780,anael.erhardt@etu.u-bordeaux.fr,MULLE_CARTA,233,personnel.picture.943d39c0bdff7b4f.616e61656c2e6a7067.jpg,1071,aerhardt,Anaël,France,M,CNRS,CDD,PhD student,DOCTORANT,NEUROCAMPUS,2020-09-15,Vaincre Alzheimer,Vaincre Alzheimer,100,IINS,present,2022-09-15,2025-09-14,yes,other,no
MULLE,+33533514716,+33533514716,christophe.mulle@u-bordeaux.fr,MULLE_CARTA,235,personnel.picture.8aa8543f99567fa1.4d756c6c652d4368726973746f7068652d506f7274726169742d3437202d20636f7069652e6a706567.jpeg,35,mulle,Christophe,France,M,CNRS,TITU,Researcher,DR,NEUROCAMPUS,2011-01-01,,,100,IINS,present,2000-09-15,2000-01-01,yes,other,yes
CARTA,+33533514759,+33533514759,mario.carta@u-bordeaux.fr,MULLE_CARTA,236,personnel.picture.8f76aa8819852e0b.4d6172696f2e6a7067.jpg,381,mcarta100p,Mario,Italy,M,CNRS,TITU,Researcher,CR,NEUROCAMPUS,2011-01-01,,,100,IINS,present,2013-10-01,2000-01-01,yes,other,no
AMEDEE,+33533514757,+33533514757,thierry.amedee@u-bordeaux.fr,MULLE_CARTA,237,personnel.picture.9f07215c067e6854.416dc3a964c3a96520323032342e6a7067.jpg,91,tamede100p,Thierry,France,M,CNRS,TITU,Researcher,DR,NEUROCAMPUS,2011-01-01,,,100,IINS,present,2000-10-01,2000-01-01,yes,other,no
MOREIRA DE SA,+33533514769,+33533514769,ana.moreira-de-sa@u-bordeaux.fr,MULLE_CARTA,238,personnel.picture.80f4747d74289da9.616e61206d6f726569726120646520736120323032322e6a706567.jpeg,1096,amoreiradesa,Ana,Portugal,F,UB,CDD,PhD student,DOCTORANT,NEUROCAMPUS,2020-11-01,GPR BRAIN,BS,100,IINS,present,2023-11-01,2024-10-31,yes,other,no
BENAC,+33533514781,+33533514781,nathan.benac@u-bordeaux.fr,GROC,242,personnel.picture.9ee24ccef44c5866.4e617468616e2042656e61632047524f43207465616d2e6a7067.jpg,908,nbenac,Nathan,France,M,CNRS,CDD,PhD student,DOCTORANT,NEUROCAMPUS,2018-11-19,ERC,ENSEMBLE LG,100,IINS,present,2021-10-01,2024-09-30,yes,other,no
NICOLE,+33533514781,+33533514781,olivier.nicole@u-bordeaux.fr,GROC,242,personnel.picture.9dee95859df812ec.6e69636f6c652d6f6c69766965722d4453435f383339372d32303070782e6a7067.jpg,1114,onicol100p,Olivier,France,M,CNRS,TITU,Researcher,CR,NEUROCAMPUS,2021-01-01,None,None,100,IINS,present,2021-01-01,2099-12-31,yes,other,no
BOUCHET TESSIER,+33533514762,+33533514762,delphine.bouchet@u-bordeaux.fr,GROC,249,personnel.picture.bd1100f7586ecfaa.44656c7068696e6520426f75636865742e6a7067.jpg,110,dbouchet,Delphine,France,F,CNRS,TITU,Technical staff,IE,NEUROCAMPUS,2011-01-01,,,100,IINS,present,2002-09-01,2000-01-01,yes,cell,no
GREA,+33533514762,+33533514762,helene.grea@u-bordeaux.fr,GROC,249,personnel.picture.b5f630ed892c0411.48c3a96cc3a86e65204772c3a9612047524f43207465616d2e6a7067.jpg,309,hgrea,Helene,France,F,UB,TITU,Researcher,None,NEUROCAMPUS,2012-11-05,1,,100,IINS,present,2002-09-01,2000-01-01,yes,other,no
DUPUIS,+33533514762,+33533514762,julien.dupuis@u-bordeaux.fr,GROC,249,personnel.picture.acacac6bd94e2df0.4a756c69656e204475707569732e6a7067.jpg,478,jdupui100p,Julien,France,M,INSERM,TITU,Researcher,CR,NEUROCAMPUS,2012-07-09,,,100,IINS,present,2014-10-01,2000-01-01,yes,other,no
Villega,+33533514762,+33533514762,frederic.villega@u-bordeaux.fr,GROC,249,personnel.picture.86987a2121cc91da.4672c3a964c3a97269632056696c6cc3a967612e6a7067.jpg,910,fvillega,Frédéric,France,M,NONE,TITU,Researcher,None,NEUROCAMPUS,2019-01-01,CHU,CHU,100,IINS,present,2022-01-01,2099-12-31,yes,other,no
GROC,+33533514702,+33533514702,laurent.groc@u-bordeaux.fr,GROC,251,personnel.picture.ba588110e6544c60.4c617572656e742047726f6320323030783230302e6a7067.jpg,82,lgroc,Laurent,France,M,CNRS,TITU,Researcher,DR,NEUROCAMPUS,2011-11-01,,,,IINS,present,2003-01-01,2000-01-01,yes,other,yes
JAMET,+33533514761,+33533514761,zoe.jamet@u-bordeaux.fr,GROC,252,personnel.picture.89c57bb6f137dc97.4a616d65745f5a6f655f776562736974652e6a7067.jpg,973,zjamet,Zoé,France,F,CNRS,CDD,Postdoc,IE,NEUROCAMPUS,2019-10-01,ANR,BetaNeuro,100,IINS,present,2024-01-01,2024-06-30,yes,other,no
FAVEREAUX,+33533514763,+33533514763,alexandre.favereaux@u-bordeaux.fr,LETELLIER_FAVEREAUX,260,personnel.picture.a91d81e3ff11b5c0.416c6578616e647265204661766572656175782032303070782e6a7067.jpg,133,afaver100p,Alexandre,France,M,UB,TITU,Researcher,None,NEUROCAMPUS,2000-01-01,,,,IINS,present,2020-09-16,2000-01-01,yes,other,yes
MEKERRI,+33533514700,<NULL>,sylvie.mekerri@u-bordeaux.fr,S.COMMUN,Accue,personnel.picture.bc3a29b65c073f6e.74656d706c6174652e6a7067.jpg,697,schaub100p,Sylvie,France,F,UB,TITU,Technical staff,AJT,MAGENDIE,2016-10-16,None,,100,IINS,present,2016-10-01,2099-12-31,yes,<NULL>,<NULL>
MARTIN,+33533514854,<NULL>,christelle.martin@u-bordeaux.fr,PIV,N4,personnel.picture.80f42e8b494bdfbb.74656d706c6174652e6a7067.jpg,379,cmartin65n,Christelle,France,F,CNRS,TITU,Technical staff,IR,NEUROCAMPUS,2013-09-01,1,,100,IINS,present,2018-04-01,2000-01-01,yes,<NULL>,<NULL>
DESHORS,+33622465643,<NULL>,melissa.deshors@u-bordeaux.fr,PIV,N4,personnel.picture.b899b8e2125f907b.74656d706c6174652e6a7067.jpg,509,mdesho100p,MElissa,France,F,CNRS,TITU,Technical staff,T,NEUROCAMPUS,2011-01-01,,,100,IINS,present,2014-12-01,2000-01-01,yes,<NULL>,<NULL>
EL OUSSINI,+33533514778,+33533514778,hajer.el-oussini@u-bordeaux.fr,PIV,N4,personnel.picture.9ca77a6d61cf8553.48616a65722e6a7067.jpg,667,heoussini,Hajer,France,F,CNRS,TITU,Technical staff,IR,NEUROCAMPUS,2016-09-01,,,100,IINS,present,2020-12-01,2099-12-31,yes,piv,no
ESPINOSA,+33533514700,+33533514700,vanessa.espinosa@u-bordeaux.fr,PIV,N4,,1546,vespinosa,Vanessa,Ecuador,O,UB,CDD,Technical staff,AJT,NEUROCAMPUS,2024-02-15,PREST PIV EXPE,PREST PIV EXPE,50,IINS,present,2024-02-15,2024-09-30,yes,piv,no
MARTINEZ MENESES ,+33533514700,+33533514700,carlos-humberto.martinez-meneses@u-bordeaux.fr,PIV,N4,,1559,None,Carlos,Mexico,M,UB,CDD,Technical staff,AJT,NEUROCAMPUS,2024-05-01,PREST PIV EXPE,PREST PIV EXPE,100,IINS,present,2024-05-01,2024-07-31,yes,piv,no
DUCROS,+33557573788,<NULL>,mathieu.ducros@u-bordeaux.fr,BIC,None,personnel.picture.9f5e960d15344256.74656d706c6174652e6a7067.jpg,620,mducros,Mathieu,France,M,INSERM,TITU,Technical staff,IR,MAGENDIE,2016-04-04,,,100,IINS,present,2015-07-01,2023-04-18,yes,<NULL>,<NULL>
AUGUSTO,+33533514777,+33533514777,elisabete.augusto@u-bordeaux.fr,GAMBINO,None,personnel.picture.b68367aa7fec2658.4175677573746f20456c697361626574652045712047616d62696e6f2e6a7067.jpg,696,eaugusto,Elisabete,Portugal,F,CNRS,CDD,Postdoc,POSTDOC,NEUROCAMPUS,2023-11-01,Marie Curie,DANAL PF23,100,IINS,present,2024-05-01,2026-04-30,yes,other,no
LALET,+33 3 55 51 47 88,<NULL>,stephanie.lalet@u-bordeaux.fr,BIC,None,personnel.picture.94def61d23882603.74656d706c6174652e6a7067.jpg,720,slalet,Stéphanie,France,F,UB,CDI,Technical staff,AI,NEUROCAMPUS,2016-04-15,None,,100,BIC,present,2016-04-15,2099-12-31,yes,<NULL>,<NULL>
CHENICLET,+33 5 57 12 25 53,<NULL>,catherine.cheniclet@u-bordeaux.fr,BIC,None,personnel.picture.ab0a4ac2537bf7de.74656d706c6174652e6a7067.jpg,840,ccheniclet,Catherine,France,F,CNRS,TITU,Researcher,CR,NEUROCAMPUS,2011-01-01,None,,100,IINS,present,2011-01-01,2099-12-31,yes,<NULL>,<NULL>